{"text_format":"1","workbook":"xlsx","n_sheets":6,"sheets":["Home","FRGN","CPNY","INDV","STPT","Drop Down"],"not_rendered":{"charts":0,"images":1,"macros":0,"external_links":0,"defined_names":8,"comments":4,"pivot_tables":0},"unopened":[],"bounds":{"document_bytes":16777216,"sheet_cells":100000,"rows_first":2000,"rows_last":500,"rows_between":2000,"halvings":0,"cell_chars":16384,"cell_head_chars":4096},"cells_cut":0,"cells_raw":0,"read":"whole","date_system":"1900"}

{"sheet":"Home","index":0,"n_rows":9,"n_cols":4,"rows_kept":9,"cut":false,"hidden":false,"merged":[[1,2,1,3],[2,2,2,3],[3,2,3,3],[4,2,4,3],[8,2,8,3],[5,2,5,3]]}
[null,null,"Supplier Information Form (SIF) Version 2.0 Effective 10-27-2020"]
[]
[null,null,"Supplier/Individual/Study Participant/ACH/Wire Form"]
[null,null,"FORM DESCRIPTION:\nThis form is used to establish or update a record within the Emory University Procurement system and meets the Federal requirements to request a taxpayer identification number (TIN), request certain certifications for Federal procurement reporting and claims for exemption, and internal requirements. Do not return this form to the IRS."]
[null,null,"NOTE TO SUPPLIER: Submission of this form does not authorize a supplier to provide goods or services to Emory University until the supplier is notified by Procurement."]
[null,null,"Preliminary Questions"]
[null,null,"Select if you are a Company, Individual, or Study Participant:","Company"]
[null,null,{"$f":"IF(D7=\"\",\"\",IF(D7=\"Company\",\"Is your company a US based entity for tax purposes?\",\"Are you a US citizen or resident for tax purposes?\"))","v":"Is your company a US based entity for tax purposes?"},"Yes"]
[null,null,{"$f":"IF(AND(D7<>\"\",D8=\"No\"),HYPERLINK(CONCATENATE(\"#FRGN!h4\"),\"Click Here to Proceed\"),IF(AND(D7=\"Study Participant\",D8=\"Yes\"),HYPERLINK(CONCATENATE(\"#STPT!h10\"),\"Click Here to Proceed\"),IF(AND(D7=\"Individual\",D8=\"Yes\"),HYPERLINK(CONCATENATE(\"#INDV!h4\"),\"Click Here to Proceed\"),IF(AND(D7=\"Company\",D8=\"Yes\"),HYPERLINK(CONCATENATE(\"#CPNY!h4\"),\"Click Here to Proceed\"),\"Please fill in all Yellow Cells\"))))","v":"Click Here to Proceed"}]

{"sheet":"FRGN","index":1,"n_rows":73,"n_cols":10,"rows_kept":73,"cut":false,"hidden":false,"merged":[[69,6,69,7],[44,6,44,7],[45,6,45,7],[52,6,52,7],[62,6,62,7],[68,6,68,7],[1,6,1,7],[8,6,8,7],[27,6,27,7],[37,6,37,7],[43,6,43,7],[2,6,2,7],[7,6,7,7],[31,6,31,7]]}
[null,null,null,null,null,null,{"$f":"Home!C1&\" (\"&IF(Home!D8=\"No\",\"Foreign Source Statement for \",\"\")&Home!$D$7&\")\"","v":"Supplier Information Form (SIF) Version 2.0 Effective 10-27-2020 (Company)"}]
[null,{"$f":"IF(Home!$D$8=\"No\",\"Conditional Formatting\",\"\")","v":""},"Error Validation","No",null,null,{"$f":"IF(AND(COUNTIF($B$3:$B$73,\"R\")>0,COUNTIF($B$3:$B$73,\"C\")>0),\"There are \"&COUNTIF($B$3:$B$73,\"R\")&\" required fields remaining highlighted in yellow with mini-dots.\"&CHAR(10)&\"There are \"&COUNTIF($B$3:$B$73,\"C\")&\" fields that need correction highlighted in red.\",IF(AND(COUNTIF($B$3:$B$73,\"R\")>0,COUNTIF($B$3:$B$73,\"C\")=0),\"There are \"&COUNTIF($B$3:$B$73,\"R\")&\" required fields remaining highlighted in yellow with mini-dots.\",IF(AND(COUNTIF($B$3:$B$73,\"R\")=0,COUNTIF($B$3:$B$73,\"C\")>0),\"There are \"&COUNTIF($B$3:$B$73,\"C\")&\" fields that need correction highlighted in red.\",\"Completed! Please submit this excel file to the Emory personnel that provided you this form.\")))","v":"Completed! Please submit this excel file to the Emory personnel that provided you this form."},null,null,{"$f":"HYPERLINK(CONCATENATE(\"#Home!D8\"),\"Click Here to Go Back\")","v":"Click Here to Go Back"}]
[null,{"$f":"IF(OR(Home!$D$8=\"\",Home!$D$8=\"Yes\"),\"\",IF(H3=\"\",HLOOKUP(Home!$D$8,FRGN!$D$2:$F$73,ROW(A2),FALSE),IF(C3=FALSE,\"C\")))","v":""},true,"Y",null,null,{"$f":"Home!$D$7&\" Prerequisite Questions\"","v":"Company Prerequisite Questions"}]
[null,{"$f":"IF(OR(Home!$D$8=\"\",Home!$D$8=\"Yes\"),\"\",IF(H4=\"\",HLOOKUP(Home!$D$8,FRGN!$D$2:$F$73,ROW(A3),FALSE),IF(C4=FALSE,\"C\")))","v":""},true,"R",null,null,{"$f":"IF(Home!$D$7=\"Company\",\"Is your company\",IF(Home!$D$7<>\"Company\",\"Are you\",\"\"))&\" filling out this form to update current information on file with Emory? If not sure, select 'No' from drop down box.\"","v":"Is your company filling out this form to update current information on file with Emory? If not sure, select 'No' from drop down box."},"No"]
[null,{"$f":"IF(OR(Home!$D$8=\"\",Home!$D$8=\"Yes\"),\"\",IF(H5=\"\",HLOOKUP(Home!$D$8,FRGN!$D$2:$F$73,ROW(A4),FALSE),IF(C5=FALSE,\"C\")))","v":""},true,{"$f":"IF(H4=\"Yes\",\"R\",\"Y\")","v":"Y"},null,null,{"$f":"IF(H4=\"Yes\",IF(Home!$D$7=\"Company\",\"Does your company\",IF(Home!$D$7<>\"Company\",\"Do you\",\"\"))&\" only need to update the Wire Payment information on file with Emory?\",\"\")","v":""}]
[null,{"$f":"IF(OR(Home!$D$8=\"\",Home!$D$8=\"Yes\"),\"\",IF(H6=\"\",HLOOKUP(Home!$D$8,FRGN!$D$2:$F$73,ROW(A5),FALSE),IF(C6=FALSE,\"C\")))","v":""},true,{"$f":"IF(Home!D7=\"Company\",\"R\",\"Y\")","v":"R"},null,null,{"$f":"IF(Home!D7=\"Company\",\"Is your company the direct output of a merger, acquisition, or spinoff?\",\"\")","v":"Is your company the direct output of a merger, acquisition, or spinoff?"}]
[null,{"$f":"IF(OR(Home!$D$8=\"\",Home!$D$8=\"Yes\"),\"\",IF(H7=\"\",HLOOKUP(Home!$D$8,FRGN!$D$2:$F$73,ROW(A6),FALSE),IF(C7=FALSE,\"C\")))","v":""},true,{"$f":"IF(H6=\"Yes\",\"R\",\"Y\")","v":"Y"},null,null,{"$f":"IF(H6=\"Yes\",\"Please provide a brief description of the merger, acquisition, or spinoff:\",\"\")","v":""}]
[null,{"$f":"IF(OR(Home!$D$8=\"\",Home!$D$8=\"Yes\"),\"\",IF(H8=\"\",HLOOKUP(Home!$D$8,FRGN!$D$2:$F$73,ROW(A7),FALSE),IF(C8=FALSE,\"C\")))","v":""},true,"Y"]
[null,{"$f":"IF(OR(Home!$D$8=\"\",Home!$D$8=\"Yes\"),\"\",IF(H9=\"\",HLOOKUP(Home!$D$8,FRGN!$D$2:$F$73,ROW(A8),FALSE),IF(C9=FALSE,\"C\")))","v":""},true,{"$f":"IF(COUNTIF($B$4:$B$7,\"R\")>0,\"\",\"Y\")","v":"Y"},null,null,{"$f":"Home!$D$7&\" Name and General Information\"","v":"Company Name and General Information"}]
[null,{"$f":"IF(OR(Home!$D$8=\"\",Home!$D$8=\"Yes\"),\"\",IF(H10=\"\",HLOOKUP(Home!$D$8,FRGN!$D$2:$F$73,ROW(A9),FALSE),IF(C10=FALSE,\"C\")))","v":""},true,{"$f":"IF(COUNTIF($B$4:$B$7,\"R\")>0,\"\",IF($H$5=\"Yes\",\"Y\",\"R\"))","v":"R"},null,null,"Legal name that is the beneficial owner of payment received:"]
{"$rows_left_out":64}
{"sheet":"CPNY","index":2,"n_rows":102,"n_cols":10,"rows_kept":102,"cut":false,"hidden":false,"merged":[[76,6,76,7],[77,6,77,7],[86,6,86,7],[92,6,92,7],[97,6,97,7],[96,6,96,7],[78,6,78,7],[57,6,57,7],[56,6,56,7],[2,6,2,7],[1,6,1,7],[28,6,28,7],[36,6,36,7],[47,6,47,7],[8,6,8,7],[7,6,7,7]]}
[null,null,null,null,null,null,{"$f":"Home!C1&\" (\"&IF(Home!D8=\"Yes\",\"Domestic \",\"\")&Home!$D$7&\")\"","v":"Supplier Information Form (SIF) Version 2.0 Effective 10-27-2020 (Domestic Company)"}]
[null,{"$f":"IF(AND(Home!$D$7=\"Company\",Home!$D$8<>\"No\"),\"Conditional Formatting\",\"\")","v":"Conditional Formatting"},"Error Validation","Company","Individual","Study Participant",{"$f":"IF(AND(COUNTIF($B$3:$B$102,\"R\")>0,COUNTIF($B$3:$B$102,\"C\")>0),\"There are \"&COUNTIF($B$3:$B$102,\"R\")&\" required fields remaining highlighted in yellow with mini-dots.\"&CHAR(10)&\"There are \"&COUNTIF($B$3:$B$102,\"C\")&\" fields that need correction highlighted in red.\",IF(AND(COUNTIF($B$3:$B$102,\"R\")>0,COUNTIF($B$3:$B$102,\"C\")=0),\"There are \"&COUNTIF($B$3:$B$102,\"R\")&\" required fields remaining highlighted in yellow with mini-dots.\",IF(AND(COUNTIF($B$3:$B$102,\"R\")=0,COUNTIF($B$3:$B$102,\"C\")>0),\"There are \"&COUNTIF($B$3:$B$102,\"C\")&\" fields that need correction highlighted in red.\",\"Completed! Please submit this excel file to the Emory personnel that provided you this form.\")))","v":"There are 2 required fields remaining highlighted in yellow with mini-dots."},null,null,{"$f":"HYPERLINK(CONCATENATE(\"#Home!D8\"),\"Click Here to Go Back\")","v":"Click Here to Go Back"}]
[null,{"$f":"IF(OR(Home!$D$7=\"\",Home!$D$8=\"No\"),\"\",IF(ISBLANK(HLOOKUP(Home!$D$7,$D$2:$F$102,ROW(A2),FALSE)),\"\",IF(H3=\"\",HLOOKUP(Home!$D$7,$D$2:$F$102,ROW(A2),FALSE),IF(C3=FALSE,\"C\"))))","v":"Y"},true,"Y",null,null,"Prerequisite Questions"]
[null,{"$f":"IF(OR(Home!$D$7=\"\",Home!$D$8=\"No\"),\"\",IF(ISBLANK(HLOOKUP(Home!$D$7,$D$2:$F$102,ROW(A3),FALSE)),\"\",IF(H4=\"\",HLOOKUP(Home!$D$7,$D$2:$F$102,ROW(A3),FALSE),IF(C4=FALSE,\"C\"))))","v":"R"},true,"R",null,null,{"$f":"IF(Home!$D$7=\"Company\",\"Is your company\",IF(Home!$D$7=\"Individual\",\"Are you\",\"\"))&\" filling out this form to update current information on file with Emory? If not sure, select 'No' from drop down box.\"","v":"Is your company filling out this form to update current information on file with Emory? If not sure, select 'No' from drop down box."}]
[null,{"$f":"IF(OR(Home!$D$7=\"\",Home!$D$8=\"No\"),\"\",IF(ISBLANK(HLOOKUP(Home!$D$7,$D$2:$F$102,ROW(A4),FALSE)),\"\",IF(H5=\"\",HLOOKUP(Home!$D$7,$D$2:$F$102,ROW(A4),FALSE),IF(C5=FALSE,\"C\"))))","v":"Y"},true,{"$f":"IF(H4=\"Yes\",\"R\",\"Y\")","v":"Y"},null,null,{"$f":"IF(H4=\"Yes\",IF(Home!$D$7=\"Company\",\"Does your company\",IF(Home!$D$7=\"Individual\",\"Do you\",\"\"))&\" only need to update the ACH/Banking information on file with Emory?\",\"\")","v":""}]
[null,{"$f":"IF(OR(Home!$D$7=\"\",Home!$D$8=\"No\"),\"\",IF(ISBLANK(HLOOKUP(Home!$D$7,$D$2:$F$102,ROW(A5),FALSE)),\"\",IF(H6=\"\",HLOOKUP(Home!$D$7,$D$2:$F$102,ROW(A5),FALSE),IF(C6=FALSE,\"C\"))))","v":"R"},true,"R",null,null,"Is your company the direct output of a merger, acquisition, or spinoff?"]
[null,{"$f":"IF(OR(Home!$D$7=\"\",Home!$D$8=\"No\"),\"\",IF(ISBLANK(HLOOKUP(Home!$D$7,$D$2:$F$102,ROW(A6),FALSE)),\"\",IF(H7=\"\",HLOOKUP(Home!$D$7,$D$2:$F$102,ROW(A6),FALSE),IF(C7=FALSE,\"C\"))))","v":"Y"},true,{"$f":"IF(H6=\"Yes\",\"R\",\"Y\")","v":"Y"},null,null,{"$f":"IF(H6=\"Yes\",\"Please provide a brief description of the merger, acquisition, or spinoff:\",\"\")","v":""}]
[null,{"$f":"IF(OR(Home!$D$7=\"\",Home!$D$8=\"No\"),\"\",IF(ISBLANK(HLOOKUP(Home!$D$7,$D$2:$F$102,ROW(A7),FALSE)),\"\",IF(H8=\"\",HLOOKUP(Home!$D$7,$D$2:$F$102,ROW(A7),FALSE),IF(C8=FALSE,\"C\"))))","v":"Y"},true,"Y"]
[null,{"$f":"IF(OR(Home!$D$7=\"\",Home!$D$8=\"No\"),\"\",IF(ISBLANK(HLOOKUP(Home!$D$7,$D$2:$F$102,ROW(A8),FALSE)),\"\",IF(H9=\"\",HLOOKUP(Home!$D$7,$D$2:$F$102,ROW(A8),FALSE),IF(C9=FALSE,\"C\"))))","v":""},true,{"$f":"IF(COUNTIF($B$4:$B$7,\"R\")>0,\"\",\"Y\")","v":""},null,null,{"$f":"Home!D7&\" Name and Information\"","v":"Company Name and Information"}]
[null,{"$f":"IF(OR(Home!$D$7=\"\",Home!$D$8=\"No\"),\"\",IF(ISBLANK(HLOOKUP(Home!$D$7,$D$2:$F$102,ROW(A9),FALSE)),\"\",IF(H10=\"\",HLOOKUP(Home!$D$7,$D$2:$F$102,ROW(A9),FALSE),IF(C10=FALSE,\"C\"))))","v":""},true,{"$f":"IF(COUNTIF($B$4:$B$7,\"R\")>0,\"\",IF($H$5=\"Yes\",\"Y\",\"R\"))","v":""},null,null,"Legal Full Name:"]
{"$rows_left_out":93}
{"sheet":"INDV","index":3,"n_rows":102,"n_cols":10,"rows_kept":102,"cut":false,"hidden":false,"merged":[[36,6,36,7],[1,6,1,7],[2,6,2,7],[7,6,7,7],[8,6,8,7],[28,6,28,7],[86,6,86,7],[92,6,92,7],[96,6,96,7],[97,6,97,7],[47,6,47,7],[56,6,56,7],[57,6,57,7],[76,6,76,7],[77,6,77,7],[78,6,78,7]]}
[null,null,null,null,null,null,{"$f":"Home!C1&\" (\"&IF(Home!D8=\"Yes\",\"Domestic \",\"\")&Home!$D$7&\")\"","v":"Supplier Information Form (SIF) Version 2.0 Effective 10-27-2020 (Domestic Company)"}]
[null,{"$f":"IF(AND(Home!$D$7=\"Individual\",Home!$D$8<>\"No\"),\"Conditional Formatting\",\"\")","v":""},"Error Validation","Company","Individual","Study Participant",{"$f":"IF(AND(COUNTIF($B$3:$B$102,\"R\")>0,COUNTIF($B$3:$B$102,\"C\")>0),\"There are \"&COUNTIF($B$3:$B$102,\"R\")&\" required fields remaining highlighted in yellow with mini-dots.\"&CHAR(10)&\"There are \"&COUNTIF($B$3:$B$102,\"C\")&\" fields that need correction highlighted in red.\",IF(AND(COUNTIF($B$3:$B$102,\"R\")>0,COUNTIF($B$3:$B$102,\"C\")=0),\"There are \"&COUNTIF($B$3:$B$102,\"R\")&\" required fields remaining highlighted in yellow with mini-dots.\",IF(AND(COUNTIF($B$3:$B$102,\"R\")=0,COUNTIF($B$3:$B$102,\"C\")>0),\"There are \"&COUNTIF($B$3:$B$102,\"C\")&\" fields that need correction highlighted in red.\",\"Completed! Please submit this excel file to the Emory personnel that provided you this form.\")))","v":"Completed! Please submit this excel file to the Emory personnel that provided you this form."},null,null,{"$f":"HYPERLINK(CONCATENATE(\"#Home!D8\"),\"Click Here to Go Back\")","v":"Click Here to Go Back"}]
[null,{"$f":"IF(OR(Home!$D$7=\"\",Home!$D$8=\"No\"),\"\",IF(ISBLANK(HLOOKUP(Home!$D$7,$D$2:$F$102,ROW(A2),FALSE)),\"\",IF(H3=\"\",HLOOKUP(Home!$D$7,$D$2:$F$102,ROW(A2),FALSE),IF(C3=FALSE,\"C\"))))","v":""},true,null,"Y",null,"Prerequisite Questions"]
[null,{"$f":"IF(OR(Home!$D$7=\"\",Home!$D$8=\"No\"),\"\",IF(ISBLANK(HLOOKUP(Home!$D$7,$D$2:$F$102,ROW(A3),FALSE)),\"\",IF(H4=\"\",HLOOKUP(Home!$D$7,$D$2:$F$102,ROW(A3),FALSE),IF(C4=FALSE,\"C\"))))","v":""},true,null,"R",null,{"$f":"IF(Home!$D$7=\"Company\",\"Is your company\",IF(Home!$D$7=\"Individual\",\"Are you\",\"\"))&\" filling out this form to update current information on file with Emory? If not sure, select 'No' from drop down box.\"","v":"Is your company filling out this form to update current information on file with Emory? If not sure, select 'No' from drop down box."}]
[null,{"$f":"IF(OR(Home!$D$7=\"\",Home!$D$8=\"No\"),\"\",IF(ISBLANK(HLOOKUP(Home!$D$7,$D$2:$F$102,ROW(A4),FALSE)),\"\",IF(H5=\"\",HLOOKUP(Home!$D$7,$D$2:$F$102,ROW(A4),FALSE),IF(C5=FALSE,\"C\"))))","v":""},true,null,{"$f":"IF(H4=\"Yes\",\"R\",\"Y\")","v":"Y"},null,{"$f":"IF(H4=\"Yes\",IF(Home!$D$7=\"Company\",\"Does your company\",IF(Home!$D$7=\"Individual\",\"Do you\",\"\"))&\" only need to update the ACH/Banking information on file with Emory?\",\"\")","v":""}]
[null,{"$f":"IF(OR(Home!$D$7=\"\",Home!$D$8=\"No\"),\"\",IF(ISBLANK(HLOOKUP(Home!$D$7,$D$2:$F$102,ROW(A5),FALSE)),\"\",IF(H6=\"\",HLOOKUP(Home!$D$7,$D$2:$F$102,ROW(A5),FALSE),IF(C6=FALSE,\"C\"))))","v":""},true,null,null,null,"Is your company the direct output of a merger, acquisition, or spinoff?","No"]
[null,{"$f":"IF(OR(Home!$D$7=\"\",Home!$D$8=\"No\"),\"\",IF(ISBLANK(HLOOKUP(Home!$D$7,$D$2:$F$102,ROW(A6),FALSE)),\"\",IF(H7=\"\",HLOOKUP(Home!$D$7,$D$2:$F$102,ROW(A6),FALSE),IF(C7=FALSE,\"C\"))))","v":""},true,null,null,null,{"$f":"IF(H6=\"Yes\",\"Please provide a brief description of the merger, acquisition, or spinoff:\",\"\")","v":""}]
[null,{"$f":"IF(OR(Home!$D$7=\"\",Home!$D$8=\"No\"),\"\",IF(ISBLANK(HLOOKUP(Home!$D$7,$D$2:$F$102,ROW(A7),FALSE)),\"\",IF(H8=\"\",HLOOKUP(Home!$D$7,$D$2:$F$102,ROW(A7),FALSE),IF(C8=FALSE,\"C\"))))","v":""},true,null,"Y"]
[null,{"$f":"IF(OR(Home!$D$7=\"\",Home!$D$8=\"No\"),\"\",IF(ISBLANK(HLOOKUP(Home!$D$7,$D$2:$F$102,ROW(A8),FALSE)),\"\",IF(H9=\"\",HLOOKUP(Home!$D$7,$D$2:$F$102,ROW(A8),FALSE),IF(C9=FALSE,\"C\"))))","v":""},true,null,{"$f":"IF(COUNTIF($B$4:$B$7,\"R\")>0,\"\",\"Y\")","v":"Y"},null,{"$f":"Home!D7&\" Name and Information\"","v":"Company Name and Information"}]
[null,{"$f":"IF(OR(Home!$D$7=\"\",Home!$D$8=\"No\"),\"\",IF(ISBLANK(HLOOKUP(Home!$D$7,$D$2:$F$102,ROW(A9),FALSE)),\"\",IF(H10=\"\",HLOOKUP(Home!$D$7,$D$2:$F$102,ROW(A9),FALSE),IF(C10=FALSE,\"C\"))))","v":""},true,null,{"$f":"IF(COUNTIF($B$4:$B$7,\"R\")>0,\"\",IF($H$5=\"Yes\",\"Y\",\"R\"))","v":"R"},null,"Legal Full Name:"]
{"$rows_left_out":93}
{"sheet":"STPT","index":4,"n_rows":102,"n_cols":10,"rows_kept":102,"cut":false,"hidden":false,"merged":[[36,6,36,7],[1,6,1,7],[2,6,2,7],[7,6,7,7],[8,6,8,7],[28,6,28,7],[86,6,86,7],[92,6,92,7],[96,6,96,7],[97,6,97,7],[47,6,47,7],[56,6,56,7],[57,6,57,7],[76,6,76,7],[77,6,77,7],[78,6,78,7]]}
[null,null,null,null,null,null,{"$f":"Home!C1&\" (\"&IF(Home!D8=\"Yes\",\"Domestic \",\"\")&Home!$D$7&\")\"","v":"Supplier Information Form (SIF) Version 2.0 Effective 10-27-2020 (Domestic Company)"}]
[null,{"$f":"IF(AND(Home!$D$7=\"Study Participant\",Home!$D$8<>\"No\"),\"Conditional Formatting\",\"\")","v":""},"Error Validation","Company","Individual","Study Participant",{"$f":"IF(AND(COUNTIF($B$3:$B$102,\"R\")>0,COUNTIF($B$3:$B$102,\"C\")>0),\"There are \"&COUNTIF($B$3:$B$102,\"R\")&\" required fields remaining highlighted in yellow with mini-dots.\"&CHAR(10)&\"There are \"&COUNTIF($B$3:$B$102,\"C\")&\" fields that need correction highlighted in red.\",IF(AND(COUNTIF($B$3:$B$102,\"R\")>0,COUNTIF($B$3:$B$102,\"C\")=0),\"There are \"&COUNTIF($B$3:$B$102,\"R\")&\" required fields remaining highlighted in yellow with mini-dots.\",IF(AND(COUNTIF($B$3:$B$102,\"R\")=0,COUNTIF($B$3:$B$102,\"C\")>0),\"There are \"&COUNTIF($B$3:$B$102,\"C\")&\" fields that need correction highlighted in red.\",\"Completed! Please submit this excel file to the Emory personnel that provided you this form.\")))","v":"Completed! Please submit this excel file to the Emory personnel that provided you this form."},null,null,{"$f":"HYPERLINK(CONCATENATE(\"#Home!D8\"),\"Click Here to Go Back\")","v":"Click Here to Go Back"}]
[null,{"$f":"IF(OR(Home!$D$7=\"\",Home!$D$8=\"No\"),\"\",IF(ISBLANK(HLOOKUP(Home!$D$7,$D$2:$F$102,ROW(A2),FALSE)),\"\",IF(H3=\"\",HLOOKUP(Home!$D$7,$D$2:$F$102,ROW(A2),FALSE),IF(C3=FALSE,\"C\"))))","v":""},true,null,null,null,"Prerequisite Questions"]
[null,{"$f":"IF(OR(Home!$D$7=\"\",Home!$D$8=\"No\"),\"\",IF(ISBLANK(HLOOKUP(Home!$D$7,$D$2:$F$102,ROW(A3),FALSE)),\"\",IF(H4=\"\",HLOOKUP(Home!$D$7,$D$2:$F$102,ROW(A3),FALSE),IF(C4=FALSE,\"C\"))))","v":""},true,null,null,null,{"$f":"IF(Home!$D$7=\"Company\",\"Is your company\",IF(Home!$D$7=\"Individual\",\"Are you\",\"\"))&\" filling out this form to update current information on file with Emory? If not sure, select 'No' from drop down box.\"","v":"Is your company filling out this form to update current information on file with Emory? If not sure, select 'No' from drop down box."},"Yes"]
[null,{"$f":"IF(OR(Home!$D$7=\"\",Home!$D$8=\"No\"),\"\",IF(ISBLANK(HLOOKUP(Home!$D$7,$D$2:$F$102,ROW(A4),FALSE)),\"\",IF(H5=\"\",HLOOKUP(Home!$D$7,$D$2:$F$102,ROW(A4),FALSE),IF(C5=FALSE,\"C\"))))","v":""},true,null,null,null,{"$f":"IF(H4=\"Yes\",IF(Home!$D$7=\"Company\",\"Does your company\",IF(Home!$D$7=\"Individual\",\"Do you\",\"\"))&\" only need to update the ACH/Banking information on file with Emory?\",\"\")","v":"Does your company only need to update the ACH/Banking information on file with Emory?"},"No"]
[null,{"$f":"IF(OR(Home!$D$7=\"\",Home!$D$8=\"No\"),\"\",IF(ISBLANK(HLOOKUP(Home!$D$7,$D$2:$F$102,ROW(A5),FALSE)),\"\",IF(H6=\"\",HLOOKUP(Home!$D$7,$D$2:$F$102,ROW(A5),FALSE),IF(C6=FALSE,\"C\"))))","v":""},true,null,null,null,"Is your company the direct output of a merger, acquisition, or spinoff?","No"]
[null,{"$f":"IF(OR(Home!$D$7=\"\",Home!$D$8=\"No\"),\"\",IF(ISBLANK(HLOOKUP(Home!$D$7,$D$2:$F$102,ROW(A6),FALSE)),\"\",IF(H7=\"\",HLOOKUP(Home!$D$7,$D$2:$F$102,ROW(A6),FALSE),IF(C7=FALSE,\"C\"))))","v":""},true,null,null,null,{"$f":"IF(H6=\"Yes\",\"Please provide a brief description of the merger, acquisition, or spinoff:\",\"\")","v":""}]
[null,{"$f":"IF(OR(Home!$D$7=\"\",Home!$D$8=\"No\"),\"\",IF(ISBLANK(HLOOKUP(Home!$D$7,$D$2:$F$102,ROW(A7),FALSE)),\"\",IF(H8=\"\",HLOOKUP(Home!$D$7,$D$2:$F$102,ROW(A7),FALSE),IF(C8=FALSE,\"C\"))))","v":""},true,null,null,"Y"]
[null,{"$f":"IF(OR(Home!$D$7=\"\",Home!$D$8=\"No\"),\"\",IF(ISBLANK(HLOOKUP(Home!$D$7,$D$2:$F$102,ROW(A8),FALSE)),\"\",IF(H9=\"\",HLOOKUP(Home!$D$7,$D$2:$F$102,ROW(A8),FALSE),IF(C9=FALSE,\"C\"))))","v":""},true,null,null,"Y",{"$f":"Home!D7&\" Name and Information\"","v":"Company Name and Information"}]
[null,{"$f":"IF(OR(Home!$D$7=\"\",Home!$D$8=\"No\"),\"\",IF(ISBLANK(HLOOKUP(Home!$D$7,$D$2:$F$102,ROW(A9),FALSE)),\"\",IF(H10=\"\",HLOOKUP(Home!$D$7,$D$2:$F$102,ROW(A9),FALSE),IF(C10=FALSE,\"C\"))))","v":""},true,null,null,"R","Legal Full Name:"]
{"$rows_left_out":93}
{"sheet":"Drop Down","index":5,"n_rows":249,"n_cols":21,"rows_kept":249,"cut":false,"hidden":true,"merged":[]}
[null,"State",null,"Payment Terms",null,"Countries","US Territory",null,"Countries where the use of IBAN is mandatory",null,null,null,null,"Additional Information",null,null,null,"Currency","ISO","Symbol","Combined"]
[null,"AL",null,"My firm agrees to Net 0 payment terms through the SUA (Single Use Credit Card) Program.",null,"Afghanistan",null,null,"Country","IBAN length","IBAN examples","Combined",null,"Australia","AUD","6-digit BSB (Bank/State/Branch) routing code required",null,"United States Dollar","USD","$","USD - United States Dollar ($)"]
[null,"AK",null,"My firm is already enrolled in the SUA (Single Use Credit Card) Program.",null,"Albania",null,null,"Albania",28,"AL47212110090000000235698741","IBAN Length Must be 28 Characters.\nAn IBAN example is AL47212110090000000235698741",null,"Brazil","BRL","Agencia number (Bank Branch Number) 3-7 digits\n14-Digit CJNP (Tax Payer ID) for corporations or 9-Digit CPF for individuals\nBeneficiary name, telephone (+ Country Code), full address and email",null,"UAE Dirham","AED","د.إ","AED - UAE Dirham (د.إ)"]
[null,"AZ",null,"My firm agrees to Net 30 payment terms.",null,"Algeria",null,null,"Andorra",24,"AD1200012030200359100100",{"$f":"\"IBAN Length Must be \"&J4&\" Characters.\"&CHAR(10)&\"An IBAN example is \"&K4","v":"IBAN Length Must be 24 Characters.\nAn IBAN example is AD1200012030200359100100"},null,"United Kingdom","GBP","Account number + sort code (6 digits) or IBAN can be used within the U.K.",null,"Albanian Lek","ALL","L","ALL - Albanian Lek (L)"]
[null,"AR",null,"My firm has a contract with Emory stating the payment terms.",null,"American Samoa","Y",null,"Austria",20,"AT611904300234573201","IBAN Length Must be 20 Characters.\nAn IBAN example is AT611904300234573201",null,"Canada","CAD ","Include 9-digit Canadian transit number",null,"Neth Antilles Guilder","ANG","NAƒ","ANG - Neth Antilles Guilder (NAƒ)"]
[null,"CA",null,null,null,"Andorra",null,null,"Azerbaijan",28,"AZ21NABZ00000000137010001944","IBAN Length Must be 28 Characters.\nAn IBAN example is AZ21NABZ00000000137010001944",null,"Guatemala","GTQ","Payment to Individuals are not permitted",null,"Argentine Peso","ARS","$","ARS - Argentine Peso ($)"]
[null,"CO",null,null,null,"Angola",null,null,"Bahrain",22,"BH67BMAG00001299123456","IBAN Length Must be 22 Characters.\nAn IBAN example is BH67BMAG00001299123456",null,"India","INR","Provide an Indian Financial Systems Code (IFSC Code - 11 Characters)\nProvide a Foreign Inward Remittance Certificate (FIRC) if required by Beneficiary Bank",null,"Australian Dollar","AUD","$","AUD - Australian Dollar ($)"]
[null,"CT",null,null,null,"Anguilla",null,null,"Belarus",28,"BY13NBRB3600900000002Z00AB00","IBAN Length Must be 28 Characters.\nAn IBAN example is BY13NBRB3600900000002Z00AB00",null,"Israel","ILS","Bank number and branch number also required\nSwift option A (BIC) must be used in all relevant fields to avoid processing delays",null,"Aruba Florin","AWG","ƒ","AWG - Aruba Florin (ƒ)"]
[null,"DC",null,null,null,"Antarctica",null,null,"Belgium",16,"BE68539007547034","IBAN Length Must be 16 Characters.\nAn IBAN example is BE68539007547034",null,"Palestinian Territory",null,"Details of correspondent bank if in Palestine\nBank number and branch number also required\nSwift option A (BIC) must be used in all relevant fields to avoid processing delays",null,"Barbados Dollar","BBD","BBD","BBD - Barbados Dollar (BBD)"]
[null,"DE",null,null,null,"Antigua and Barbuda",null,null,"Bosnia-Hercegovina",20,"BA391290079401028494","IBAN Length Must be 20 Characters.\nAn IBAN example is BA391290079401028494",null,"Kenya","KES","Beneficiary bank branch code and name\nBeneficiary name, telephone (+ Country Code) and full address",null,"Bangladesh Taka","BDT","Tk","BDT - Bangladesh Taka (Tk)"]
{"$rows_left_out":239}